{"text_format":"1","workbook":"xlsx","n_sheets":7,"sheets":["Hinweise","Dateneingabe","Auswertungen","Diagramm - Verbrauch","Berechnungen","Tabellen für Grafik","Stammdaten"],"not_rendered":{"charts":2,"images":2,"macros":1,"external_links":0,"defined_names":2,"comments":1,"pivot_tables":4},"unopened":[{"sheet":"Diagramm - Verbrauch","index":3,"reason":"not_a_worksheet"}],"bounds":{"document_bytes":16777216,"sheet_cells":100000,"rows_first":2000,"rows_last":500,"rows_between":2000,"halvings":0,"cell_chars":16384,"cell_head_chars":4096},"cells_cut":0,"cells_raw":0,"read":"whole","date_system":"1900"}

{"sheet":"Hinweise","index":0,"n_rows":1,"n_cols":9,"rows_kept":1,"cut":false,"hidden":false,"merged":[]}
[null,null,null,null,null,null,null,{"$f":"Dateneingabe!E1","v":"Version:"},{"$f":"Dateneingabe!F1","v":150102}]

{"sheet":"Dateneingabe","index":1,"n_rows":10,"n_cols":6,"rows_kept":10,"cut":false,"hidden":false,"merged":[[6,0,6,1],[6,2,6,3],[6,4,6,5],[1,0,1,1],[1,2,1,5],[3,1,3,5],[4,1,4,5]]}
[null,null,null,null,"Version:",150102]
[null,null,"Messung des \nStrom-Verbrauchs"]
[]
["Name:","Familie Mustermann"]
["Adresse:","Musterstraße 1, 0000 Musterhausen"]
[]
["Verbrauch",null,"Kosten",null,"Zählerwechsel"]
["Ablesedatum","Zählerstand ","Grundpreis","Arbeitspreis","Stand alt","Stand neu"]
["(tt.mm.jj)","kWh","€ / Monat","€ / kWh"]
[null,null,null,null,"<- Beginn der Aufzeichnung"]

{"sheet":"Auswertungen","index":2,"n_rows":43,"n_cols":5,"rows_kept":43,"cut":false,"hidden":false,"merged":[[3,2,3,5],[4,2,4,5],[1,2,1,5]]}
[null,null,null,{"$f":"Dateneingabe!$E$1","v":"Version:"},{"$f":"Dateneingabe!$F$1","v":150102}]
[null,null,"Messung des \nStrom Verbrauchs"]
[]
[null,"Name:",{"$f":"Dateneingabe!$B$4","v":"Familie Mustermann"}]
[null,"Adresse:",{"$f":"Dateneingabe!$B$5","v":"Musterstraße 1, 0000 Musterhausen"}]
[]
[]
[]
[null,"Strom Verbrauch pro Monat (kWh)"]
[]
[null,"Summe"]
[]
[]
[]
[]
[]
[]
[]
[]
[]
[]
[]
[]
[]
[null,"Strom Verbrauch pro Tag (kWh)"]
[]
[null,"Durchschnitt"]
[]
[]
[]
[]
[]
[]
[]
[]
[]
[]
[]
[]
[]
{"$rows_left_out":4}
{"sheet":"Berechnungen","index":4,"n_rows":106,"n_cols":18,"rows_kept":106,"cut":false,"hidden":true,"merged":[[7,0,7,1],[7,2,7,3],[7,14,7,16]]}
[]
[]
[]
[]
[]
[]
[]
[null,null,null,null,null,null,null,null,null,null,null,null,null,null,"Berechnung des durchschn. Tagesverbrauchs"]
["Ablesedatum","Zählerstand ","Pauschale","Arbeitspreis","Zähler alt","Zähler neu","Jahr","Mnt","Monat","Tag","Anz. Tage","Tage/Monat","Verbrauch","Verbr/Tag 1","Anz Tage","Verbr 1","Verbr/Tag","Kosten"]
[{"$f":"IF(Dateneingabe!A10>0,Dateneingabe!A10,\"\")","v":""},{"$f":"Dateneingabe!B10","v":0},{"$f":"Dateneingabe!C10","v":0},{"$f":"Dateneingabe!D10","v":0}]
[{"$f":"IF(Dateneingabe!A11>0,Dateneingabe!A11,\"\")","v":""},{"$f":"Dateneingabe!B11","v":0},{"$f":"IF(Dateneingabe!C11<>\"\",Dateneingabe!C11,C10)","v":0},{"$f":"IF(Dateneingabe!D11>\"\",Dateneingabe!D11,D10)","v":0},{"$f":"Dateneingabe!E11","v":0},{"$f":"Dateneingabe!F11","v":0},{"$f":"IF(A11<>\"\",YEAR(A11-5),\"\")","v":""},{"$f":"IF(A11<>\"\",(MONTH(A11-5)),\"\")","v":""},{"$f":"VLOOKUP(H11,Stammdaten!A$4:B$15,2,TRUE)","v":{"$error":"#N/A"}},{"$f":"DAY(A11)","v":{"$error":"#VALUE!"}},{"$f":"A11-A10","v":{"$error":"#VALUE!"}},{"$f":"VLOOKUP(H11,Stammdaten!A$4:C$15,3,TRUE)","v":{"$error":"#N/A"}},{"$f":"(B11+E11-B10-F11)","v":0},{"$f":"M11/(A11-A10)","v":{"$error":"#VALUE!"}},{"$f":"SUMIFS($K$11:$K$106,$H$11:$H$106,H11,$G$11:$G$106,G11)","v":{"$error":"#VALUE!"}},{"$f":"SUMIFS($M$11:$M$106,$H$11:$H$106,H11,$G$11:$G$106,G11)","v":0},{"$f":"IF(AND(H11=H12,G12=G11),\"\",(P11/O11))","v":""},{"$f":"IF(M11=\"\",\"\",(C11*K11/L11)+(D11*M11))","v":{"$error":"#VALUE!"}}]
[{"$f":"IF(Dateneingabe!A12>0,Dateneingabe!A12,\"\")","v":""},{"$f":"Dateneingabe!B12","v":0},{"$f":"IF(Dateneingabe!C12<>\"\",Dateneingabe!C12,C11)","v":0},{"$f":"IF(Dateneingabe!D12>\"\",Dateneingabe!D12,D11)","v":0},{"$f":"Dateneingabe!E12","v":0},{"$f":"Dateneingabe!F12","v":0},{"$f":"IF(A12<>\"\",YEAR(A12-5),\"\")","v":""},"",{"$f":"VLOOKUP(H12,Stammdaten!A$4:B$15,2,TRUE)","v":{"$error":"#N/A"}},{"$error":"#VALUE!"},{"$f":"A12-A11","v":{"$error":"#VALUE!"}},{"$f":"VLOOKUP(H12,Stammdaten!A$4:C$15,3,TRUE)","v":{"$error":"#N/A"}},{"$f":"(B12+E12-B11-F12)","v":0},{"$error":"#VALUE!"},{"$f":"SUMIFS($K$11:$K$106,$H$11:$H$106,H12,$G$11:$G$106,G12)","v":{"$error":"#VALUE!"}},{"$f":"SUMIFS($M$11:$M$106,$H$11:$H$106,H12,$G$11:$G$106,G12)","v":0},{"$f":"IF(AND(H12=H13,G13=G12),\"\",(P12/O12))","v":""},{"$f":"IF(M12=\"\",\"\",(C12*K12/L12)+(D12*M12))","v":{"$error":"#VALUE!"}}]
[{"$f":"IF(Dateneingabe!A13>0,Dateneingabe!A13,\"\")","v":""},{"$f":"Dateneingabe!B13","v":0},{"$f":"IF(Dateneingabe!C13<>\"\",Dateneingabe!C13,C12)","v":0},{"$f":"IF(Dateneingabe!D13>\"\",Dateneingabe!D13,D12)","v":0},{"$f":"Dateneingabe!E13","v":0},{"$f":"Dateneingabe!F13","v":0},"","",{"$f":"VLOOKUP(H13,Stammdaten!A$4:B$15,2,TRUE)","v":{"$error":"#N/A"}},{"$error":"#VALUE!"},{"$error":"#VALUE!"},{"$f":"VLOOKUP(H13,Stammdaten!A$4:C$15,3,TRUE)","v":{"$error":"#N/A"}},0,{"$error":"#VALUE!"},{"$error":"#VALUE!"},0,{"$f":"IF(AND(H13=H14,G14=G13),\"\",(P13/O13))","v":""},{"$error":"#VALUE!"}]
[{"$f":"IF(Dateneingabe!A14>0,Dateneingabe!A14,\"\")","v":""},{"$f":"Dateneingabe!B14","v":0},{"$f":"IF(Dateneingabe!C14<>\"\",Dateneingabe!C14,C13)","v":0},{"$f":"IF(Dateneingabe!D14>\"\",Dateneingabe!D14,D13)","v":0},{"$f":"Dateneingabe!E14","v":0},{"$f":"Dateneingabe!F14","v":0},"",{"$f":"IF(A14<>\"\",(MONTH(A14-5)),\"\")","v":""},{"$f":"VLOOKUP(H14,Stammdaten!A$4:B$15,2,TRUE)","v":{"$error":"#N/A"}},{"$error":"#VALUE!"},{"$error":"#VALUE!"},{"$f":"VLOOKUP(H14,Stammdaten!A$4:C$15,3,TRUE)","v":{"$error":"#N/A"}},0,{"$error":"#VALUE!"},{"$error":"#VALUE!"},0,"",{"$error":"#VALUE!"}]
[{"$f":"IF(Dateneingabe!A15>0,Dateneingabe!A15,\"\")","v":""},{"$f":"Dateneingabe!B15","v":0},{"$f":"IF(Dateneingabe!C15<>\"\",Dateneingabe!C15,C14)","v":0},{"$f":"IF(Dateneingabe!D15>\"\",Dateneingabe!D15,D14)","v":0},{"$f":"Dateneingabe!E15","v":0},{"$f":"Dateneingabe!F15","v":0},"",{"$f":"IF(A15<>\"\",(MONTH(A15-5)),\"\")","v":""},{"$f":"VLOOKUP(H15,Stammdaten!A$4:B$15,2,TRUE)","v":{"$error":"#N/A"}},{"$error":"#VALUE!"},{"$error":"#VALUE!"},{"$f":"VLOOKUP(H15,Stammdaten!A$4:C$15,3,TRUE)","v":{"$error":"#N/A"}},0,{"$error":"#VALUE!"},{"$error":"#VALUE!"},0,"",{"$error":"#VALUE!"}]
[{"$f":"IF(Dateneingabe!A16>0,Dateneingabe!A16,\"\")","v":""},{"$f":"Dateneingabe!B16","v":0},{"$f":"IF(Dateneingabe!C16<>\"\",Dateneingabe!C16,C15)","v":0},{"$f":"IF(Dateneingabe!D16>\"\",Dateneingabe!D16,D15)","v":0},{"$f":"Dateneingabe!E16","v":0},{"$f":"Dateneingabe!F16","v":0},"","",{"$f":"VLOOKUP(H16,Stammdaten!A$4:B$15,2,TRUE)","v":{"$error":"#N/A"}},{"$error":"#VALUE!"},{"$error":"#VALUE!"},{"$f":"VLOOKUP(H16,Stammdaten!A$4:C$15,3,TRUE)","v":{"$error":"#N/A"}},0,{"$error":"#VALUE!"},{"$error":"#VALUE!"},0,"",{"$error":"#VALUE!"}]
[{"$f":"IF(Dateneingabe!A17>0,Dateneingabe!A17,\"\")","v":""},{"$f":"Dateneingabe!B17","v":0},{"$f":"IF(Dateneingabe!C17<>\"\",Dateneingabe!C17,C16)","v":0},{"$f":"IF(Dateneingabe!D17>\"\",Dateneingabe!D17,D16)","v":0},{"$f":"Dateneingabe!E17","v":0},{"$f":"Dateneingabe!F17","v":0},"","",{"$f":"VLOOKUP(H17,Stammdaten!A$4:B$15,2,TRUE)","v":{"$error":"#N/A"}},{"$error":"#VALUE!"},{"$error":"#VALUE!"},{"$f":"VLOOKUP(H17,Stammdaten!A$4:C$15,3,TRUE)","v":{"$error":"#N/A"}},0,{"$error":"#VALUE!"},{"$error":"#VALUE!"},0,"",{"$error":"#VALUE!"}]
[{"$f":"IF(Dateneingabe!A18>0,Dateneingabe!A18,\"\")","v":""},{"$f":"Dateneingabe!B18","v":0},{"$f":"IF(Dateneingabe!C18<>\"\",Dateneingabe!C18,C17)","v":0},{"$f":"IF(Dateneingabe!D18>\"\",Dateneingabe!D18,D17)","v":0},{"$f":"Dateneingabe!E18","v":0},{"$f":"Dateneingabe!F18","v":0},"","",{"$f":"VLOOKUP(H18,Stammdaten!A$4:B$15,2,TRUE)","v":{"$error":"#N/A"}},{"$error":"#VALUE!"},{"$error":"#VALUE!"},{"$f":"VLOOKUP(H18,Stammdaten!A$4:C$15,3,TRUE)","v":{"$error":"#N/A"}},0,{"$error":"#VALUE!"},{"$error":"#VALUE!"},0,"",{"$error":"#VALUE!"}]
[{"$f":"IF(Dateneingabe!A19>0,Dateneingabe!A19,\"\")","v":""},{"$f":"Dateneingabe!B19","v":0},{"$f":"IF(Dateneingabe!C19<>\"\",Dateneingabe!C19,C18)","v":0},{"$f":"IF(Dateneingabe!D19>\"\",Dateneingabe!D19,D18)","v":0},{"$f":"Dateneingabe!E19","v":0},{"$f":"Dateneingabe!F19","v":0},"","",{"$f":"VLOOKUP(H19,Stammdaten!A$4:B$15,2,TRUE)","v":{"$error":"#N/A"}},{"$error":"#VALUE!"},{"$error":"#VALUE!"},{"$f":"VLOOKUP(H19,Stammdaten!A$4:C$15,3,TRUE)","v":{"$error":"#N/A"}},0,{"$error":"#VALUE!"},{"$error":"#VALUE!"},0,"",{"$error":"#VALUE!"}]
[{"$f":"IF(Dateneingabe!A20>0,Dateneingabe!A20,\"\")","v":""},{"$f":"Dateneingabe!B20","v":0},{"$f":"IF(Dateneingabe!C20<>\"\",Dateneingabe!C20,C19)","v":0},{"$f":"IF(Dateneingabe!D20>\"\",Dateneingabe!D20,D19)","v":0},{"$f":"Dateneingabe!E20","v":0},{"$f":"Dateneingabe!F20","v":0},"","",{"$f":"VLOOKUP(H20,Stammdaten!A$4:B$15,2,TRUE)","v":{"$error":"#N/A"}},{"$error":"#VALUE!"},{"$error":"#VALUE!"},{"$f":"VLOOKUP(H20,Stammdaten!A$4:C$15,3,TRUE)","v":{"$error":"#N/A"}},0,{"$error":"#VALUE!"},{"$error":"#VALUE!"},0,"",{"$error":"#VALUE!"}]
[{"$f":"IF(Dateneingabe!A21>0,Dateneingabe!A21,\"\")","v":""},{"$f":"Dateneingabe!B21","v":0},{"$f":"IF(Dateneingabe!C21<>\"\",Dateneingabe!C21,C20)","v":0},{"$f":"IF(Dateneingabe!D21>\"\",Dateneingabe!D21,D20)","v":0},{"$f":"Dateneingabe!E21","v":0},{"$f":"Dateneingabe!F21","v":0},"","",{"$f":"VLOOKUP(H21,Stammdaten!A$4:B$15,2,TRUE)","v":{"$error":"#N/A"}},{"$error":"#VALUE!"},{"$error":"#VALUE!"},{"$f":"VLOOKUP(H21,Stammdaten!A$4:C$15,3,TRUE)","v":{"$error":"#N/A"}},0,{"$f":"M21/(A21-A20)","v":{"$error":"#VALUE!"}},{"$error":"#VALUE!"},0,"",{"$error":"#VALUE!"}]
[{"$f":"IF(Dateneingabe!A22>0,Dateneingabe!A22,\"\")","v":""},{"$f":"Dateneingabe!B22","v":0},{"$f":"IF(Dateneingabe!C22<>\"\",Dateneingabe!C22,C21)","v":0},{"$f":"IF(Dateneingabe!D22>\"\",Dateneingabe!D22,D21)","v":0},{"$f":"Dateneingabe!E22","v":0},{"$f":"Dateneingabe!F22","v":0},"","",{"$f":"VLOOKUP(H22,Stammdaten!A$4:B$15,2,TRUE)","v":{"$error":"#N/A"}},{"$error":"#VALUE!"},{"$error":"#VALUE!"},{"$f":"VLOOKUP(H22,Stammdaten!A$4:C$15,3,TRUE)","v":{"$error":"#N/A"}},0,{"$error":"#VALUE!"},{"$error":"#VALUE!"},0,"",{"$error":"#VALUE!"}]
[{"$f":"IF(Dateneingabe!A23>0,Dateneingabe!A23,\"\")","v":""},{"$f":"Dateneingabe!B23","v":0},{"$f":"IF(Dateneingabe!C23<>\"\",Dateneingabe!C23,C22)","v":0},{"$f":"IF(Dateneingabe!D23>\"\",Dateneingabe!D23,D22)","v":0},{"$f":"Dateneingabe!E23","v":0},{"$f":"Dateneingabe!F23","v":0},"","",{"$f":"VLOOKUP(H23,Stammdaten!A$4:B$15,2,TRUE)","v":{"$error":"#N/A"}},{"$error":"#VALUE!"},{"$error":"#VALUE!"},{"$f":"VLOOKUP(H23,Stammdaten!A$4:C$15,3,TRUE)","v":{"$error":"#N/A"}},0,{"$error":"#VALUE!"},{"$error":"#VALUE!"},0,"",{"$error":"#VALUE!"}]
[{"$f":"IF(Dateneingabe!A24>0,Dateneingabe!A24,\"\")","v":""},{"$f":"Dateneingabe!B24","v":0},{"$f":"IF(Dateneingabe!C24<>\"\",Dateneingabe!C24,C23)","v":0},{"$f":"IF(Dateneingabe!D24>\"\",Dateneingabe!D24,D23)","v":0},{"$f":"Dateneingabe!E24","v":0},{"$f":"Dateneingabe!F24","v":0},"","",{"$f":"VLOOKUP(H24,Stammdaten!A$4:B$15,2,TRUE)","v":{"$error":"#N/A"}},{"$error":"#VALUE!"},{"$error":"#VALUE!"},{"$f":"VLOOKUP(H24,Stammdaten!A$4:C$15,3,TRUE)","v":{"$error":"#N/A"}},0,{"$error":"#VALUE!"},{"$error":"#VALUE!"},0,"",{"$error":"#VALUE!"}]
[{"$f":"IF(Dateneingabe!A25>0,Dateneingabe!A25,\"\")","v":""},{"$f":"Dateneingabe!B25","v":0},{"$f":"IF(Dateneingabe!C25<>\"\",Dateneingabe!C25,C24)","v":0},{"$f":"IF(Dateneingabe!D25>\"\",Dateneingabe!D25,D24)","v":0},{"$f":"Dateneingabe!E25","v":0},{"$f":"Dateneingabe!F25","v":0},"","",{"$f":"VLOOKUP(H25,Stammdaten!A$4:B$15,2,TRUE)","v":{"$error":"#N/A"}},{"$f":"DAY(A25)","v":{"$error":"#VALUE!"}},{"$error":"#VALUE!"},{"$f":"VLOOKUP(H25,Stammdaten!A$4:C$15,3,TRUE)","v":{"$error":"#N/A"}},0,{"$error":"#VALUE!"},{"$error":"#VALUE!"},0,"",{"$error":"#VALUE!"}]
[{"$f":"IF(Dateneingabe!A26>0,Dateneingabe!A26,\"\")","v":""},{"$f":"Dateneingabe!B26","v":0},{"$f":"IF(Dateneingabe!C26<>\"\",Dateneingabe!C26,C25)","v":0},{"$f":"IF(Dateneingabe!D26>\"\",Dateneingabe!D26,D25)","v":0},{"$f":"Dateneingabe!E26","v":0},{"$f":"Dateneingabe!F26","v":0},"","",{"$f":"VLOOKUP(H26,Stammdaten!A$4:B$15,2,TRUE)","v":{"$error":"#N/A"}},{"$f":"DAY(A26)","v":{"$error":"#VALUE!"}},{"$error":"#VALUE!"},{"$f":"VLOOKUP(H26,Stammdaten!A$4:C$15,3,TRUE)","v":{"$error":"#N/A"}},0,{"$error":"#VALUE!"},{"$error":"#VALUE!"},0,"",{"$error":"#VALUE!"}]
[{"$f":"IF(Dateneingabe!A27>0,Dateneingabe!A27,\"\")","v":""},{"$f":"Dateneingabe!B27","v":0},{"$f":"IF(Dateneingabe!C27<>\"\",Dateneingabe!C27,C26)","v":0},{"$f":"IF(Dateneingabe!D27>\"\",Dateneingabe!D27,D26)","v":0},{"$f":"Dateneingabe!E27","v":0},{"$f":"Dateneingabe!F27","v":0},"","",{"$f":"VLOOKUP(H27,Stammdaten!A$4:B$15,2,TRUE)","v":{"$error":"#N/A"}},{"$error":"#VALUE!"},{"$error":"#VALUE!"},{"$f":"VLOOKUP(H27,Stammdaten!A$4:C$15,3,TRUE)","v":{"$error":"#N/A"}},0,{"$error":"#VALUE!"},{"$error":"#VALUE!"},0,"",{"$error":"#VALUE!"}]
[{"$f":"IF(Dateneingabe!A28>0,Dateneingabe!A28,\"\")","v":""},{"$f":"Dateneingabe!B28","v":0},{"$f":"IF(Dateneingabe!C28<>\"\",Dateneingabe!C28,C27)","v":0},{"$f":"IF(Dateneingabe!D28>\"\",Dateneingabe!D28,D27)","v":0},{"$f":"Dateneingabe!E28","v":0},{"$f":"Dateneingabe!F28","v":0},"","",{"$f":"VLOOKUP(H28,Stammdaten!A$4:B$15,2,TRUE)","v":{"$error":"#N/A"}},{"$error":"#VALUE!"},{"$error":"#VALUE!"},{"$f":"VLOOKUP(H28,Stammdaten!A$4:C$15,3,TRUE)","v":{"$error":"#N/A"}},0,{"$error":"#VALUE!"},{"$error":"#VALUE!"},0,"",{"$error":"#VALUE!"}]
[{"$f":"IF(Dateneingabe!A29>0,Dateneingabe!A29,\"\")","v":""},{"$f":"Dateneingabe!B29","v":0},{"$f":"IF(Dateneingabe!C29<>\"\",Dateneingabe!C29,C28)","v":0},{"$f":"IF(Dateneingabe!D29>\"\",Dateneingabe!D29,D28)","v":0},{"$f":"Dateneingabe!E29","v":0},{"$f":"Dateneingabe!F29","v":0},"","",{"$f":"VLOOKUP(H29,Stammdaten!A$4:B$15,2,TRUE)","v":{"$error":"#N/A"}},{"$error":"#VALUE!"},{"$error":"#VALUE!"},{"$f":"VLOOKUP(H29,Stammdaten!A$4:C$15,3,TRUE)","v":{"$error":"#N/A"}},0,{"$error":"#VALUE!"},{"$error":"#VALUE!"},0,"",{"$error":"#VALUE!"}]
[{"$f":"IF(Dateneingabe!A30>0,Dateneingabe!A30,\"\")","v":""},{"$f":"Dateneingabe!B30","v":0},{"$f":"IF(Dateneingabe!C30<>\"\",Dateneingabe!C30,C29)","v":0},{"$f":"IF(Dateneingabe!D30>\"\",Dateneingabe!D30,D29)","v":0},{"$f":"Dateneingabe!E30","v":0},{"$f":"Dateneingabe!F30","v":0},"","",{"$f":"VLOOKUP(H30,Stammdaten!A$4:B$15,2,TRUE)","v":{"$error":"#N/A"}},{"$error":"#VALUE!"},{"$error":"#VALUE!"},{"$f":"VLOOKUP(H30,Stammdaten!A$4:C$15,3,TRUE)","v":{"$error":"#N/A"}},0,{"$error":"#VALUE!"},{"$error":"#VALUE!"},0,"",{"$error":"#VALUE!"}]
[{"$f":"IF(Dateneingabe!A31>0,Dateneingabe!A31,\"\")","v":""},{"$f":"Dateneingabe!B31","v":0},{"$f":"IF(Dateneingabe!C31<>\"\",Dateneingabe!C31,C30)","v":0},{"$f":"IF(Dateneingabe!D31>\"\",Dateneingabe!D31,D30)","v":0},{"$f":"Dateneingabe!E31","v":0},{"$f":"Dateneingabe!F31","v":0},"","",{"$f":"VLOOKUP(H31,Stammdaten!A$4:B$15,2,TRUE)","v":{"$error":"#N/A"}},{"$error":"#VALUE!"},{"$error":"#VALUE!"},{"$f":"VLOOKUP(H31,Stammdaten!A$4:C$15,3,TRUE)","v":{"$error":"#N/A"}},0,{"$error":"#VALUE!"},{"$error":"#VALUE!"},0,"",{"$error":"#VALUE!"}]
[{"$f":"IF(Dateneingabe!A32>0,Dateneingabe!A32,\"\")","v":""},{"$f":"Dateneingabe!B32","v":0},{"$f":"IF(Dateneingabe!C32<>\"\",Dateneingabe!C32,C31)","v":0},{"$f":"IF(Dateneingabe!D32>\"\",Dateneingabe!D32,D31)","v":0},{"$f":"Dateneingabe!E32","v":0},{"$f":"Dateneingabe!F32","v":0},"","",{"$f":"VLOOKUP(H32,Stammdaten!A$4:B$15,2,TRUE)","v":{"$error":"#N/A"}},{"$error":"#VALUE!"},{"$error":"#VALUE!"},{"$f":"VLOOKUP(H32,Stammdaten!A$4:C$15,3,TRUE)","v":{"$error":"#N/A"}},0,{"$error":"#VALUE!"},{"$error":"#VALUE!"},0,"",{"$error":"#VALUE!"}]
[{"$f":"IF(Dateneingabe!A33>0,Dateneingabe!A33,\"\")","v":""},{"$f":"Dateneingabe!B33","v":0},{"$f":"IF(Dateneingabe!C33<>\"\",Dateneingabe!C33,C32)","v":0},{"$f":"IF(Dateneingabe!D33>\"\",Dateneingabe!D33,D32)","v":0},{"$f":"Dateneingabe!E33","v":0},{"$f":"Dateneingabe!F33","v":0},"","",{"$f":"VLOOKUP(H33,Stammdaten!A$4:B$15,2,TRUE)","v":{"$error":"#N/A"}},{"$error":"#VALUE!"},{"$error":"#VALUE!"},{"$f":"VLOOKUP(H33,Stammdaten!A$4:C$15,3,TRUE)","v":{"$error":"#N/A"}},0,{"$error":"#VALUE!"},{"$error":"#VALUE!"},0,"",{"$error":"#VALUE!"}]
[{"$f":"IF(Dateneingabe!A34>0,Dateneingabe!A34,\"\")","v":""},{"$f":"Dateneingabe!B34","v":0},{"$f":"IF(Dateneingabe!C34<>\"\",Dateneingabe!C34,C33)","v":0},{"$f":"IF(Dateneingabe!D34>\"\",Dateneingabe!D34,D33)","v":0},{"$f":"Dateneingabe!E34","v":0},{"$f":"Dateneingabe!F34","v":0},"","",{"$f":"VLOOKUP(H34,Stammdaten!A$4:B$15,2,TRUE)","v":{"$error":"#N/A"}},{"$error":"#VALUE!"},{"$error":"#VALUE!"},{"$f":"VLOOKUP(H34,Stammdaten!A$4:C$15,3,TRUE)","v":{"$error":"#N/A"}},0,{"$error":"#VALUE!"},{"$error":"#VALUE!"},0,"",{"$error":"#VALUE!"}]
[{"$f":"IF(Dateneingabe!A35>0,Dateneingabe!A35,\"\")","v":""},{"$f":"Dateneingabe!B35","v":0},{"$f":"IF(Dateneingabe!C35<>\"\",Dateneingabe!C35,C34)","v":0},{"$f":"IF(Dateneingabe!D35>\"\",Dateneingabe!D35,D34)","v":0},{"$f":"Dateneingabe!E35","v":0},{"$f":"Dateneingabe!F35","v":0},"","",{"$f":"VLOOKUP(H35,Stammdaten!A$4:B$15,2,TRUE)","v":{"$error":"#N/A"}},{"$error":"#VALUE!"},{"$error":"#VALUE!"},{"$f":"VLOOKUP(H35,Stammdaten!A$4:C$15,3,TRUE)","v":{"$error":"#N/A"}},0,{"$error":"#VALUE!"},{"$error":"#VALUE!"},0,"",{"$error":"#VALUE!"}]
[{"$f":"IF(Dateneingabe!A36>0,Dateneingabe!A36,\"\")","v":""},{"$f":"Dateneingabe!B36","v":0},{"$f":"IF(Dateneingabe!C36<>\"\",Dateneingabe!C36,C35)","v":0},{"$f":"IF(Dateneingabe!D36>\"\",Dateneingabe!D36,D35)","v":0},{"$f":"Dateneingabe!E36","v":0},{"$f":"Dateneingabe!F36","v":0},"","",{"$f":"VLOOKUP(H36,Stammdaten!A$4:B$15,2,TRUE)","v":{"$error":"#N/A"}},{"$error":"#VALUE!"},{"$error":"#VALUE!"},{"$f":"VLOOKUP(H36,Stammdaten!A$4:C$15,3,TRUE)","v":{"$error":"#N/A"}},0,{"$error":"#VALUE!"},{"$error":"#VALUE!"},0,"",{"$error":"#VALUE!"}]
[{"$f":"IF(Dateneingabe!A37>0,Dateneingabe!A37,\"\")","v":""},{"$f":"Dateneingabe!B37","v":0},{"$f":"IF(Dateneingabe!C37<>\"\",Dateneingabe!C37,C36)","v":0},{"$f":"IF(Dateneingabe!D37>\"\",Dateneingabe!D37,D36)","v":0},{"$f":"Dateneingabe!E37","v":0},{"$f":"Dateneingabe!F37","v":0},"","",{"$f":"VLOOKUP(H37,Stammdaten!A$4:B$15,2,TRUE)","v":{"$error":"#N/A"}},{"$error":"#VALUE!"},{"$error":"#VALUE!"},{"$f":"VLOOKUP(H37,Stammdaten!A$4:C$15,3,TRUE)","v":{"$error":"#N/A"}},0,{"$error":"#VALUE!"},{"$error":"#VALUE!"},0,"",{"$error":"#VALUE!"}]
[{"$f":"IF(Dateneingabe!A38>0,Dateneingabe!A38,\"\")","v":""},{"$f":"Dateneingabe!B38","v":0},{"$f":"IF(Dateneingabe!C38<>\"\",Dateneingabe!C38,C37)","v":0},{"$f":"IF(Dateneingabe!D38>\"\",Dateneingabe!D38,D37)","v":0},{"$f":"Dateneingabe!E38","v":0},{"$f":"Dateneingabe!F38","v":0},"","",{"$f":"VLOOKUP(H38,Stammdaten!A$4:B$15,2,TRUE)","v":{"$error":"#N/A"}},{"$error":"#VALUE!"},{"$error":"#VALUE!"},{"$f":"VLOOKUP(H38,Stammdaten!A$4:C$15,3,TRUE)","v":{"$error":"#N/A"}},0,{"$error":"#VALUE!"},{"$error":"#VALUE!"},0,"",{"$error":"#VALUE!"}]
[{"$f":"IF(Dateneingabe!A39>0,Dateneingabe!A39,\"\")","v":""},{"$f":"Dateneingabe!B39","v":0},{"$f":"IF(Dateneingabe!C39<>\"\",Dateneingabe!C39,C38)","v":0},{"$f":"IF(Dateneingabe!D39>\"\",Dateneingabe!D39,D38)","v":0},{"$f":"Dateneingabe!E39","v":0},{"$f":"Dateneingabe!F39","v":0},"","",{"$f":"VLOOKUP(H39,Stammdaten!A$4:B$15,2,TRUE)","v":{"$error":"#N/A"}},{"$error":"#VALUE!"},{"$error":"#VALUE!"},{"$f":"VLOOKUP(H39,Stammdaten!A$4:C$15,3,TRUE)","v":{"$error":"#N/A"}},0,{"$error":"#VALUE!"},{"$error":"#VALUE!"},0,"",{"$error":"#VALUE!"}]
[{"$f":"IF(Dateneingabe!A40>0,Dateneingabe!A40,\"\")","v":""},{"$f":"Dateneingabe!B40","v":0},{"$f":"IF(Dateneingabe!C40<>\"\",Dateneingabe!C40,C39)","v":0},{"$f":"IF(Dateneingabe!D40>\"\",Dateneingabe!D40,D39)","v":0},{"$f":"Dateneingabe!E40","v":0},{"$f":"Dateneingabe!F40","v":0},"","",{"$f":"VLOOKUP(H40,Stammdaten!A$4:B$15,2,TRUE)","v":{"$error":"#N/A"}},{"$error":"#VALUE!"},{"$error":"#VALUE!"},{"$f":"VLOOKUP(H40,Stammdaten!A$4:C$15,3,TRUE)","v":{"$error":"#N/A"}},0,{"$error":"#VALUE!"},{"$error":"#VALUE!"},0,"",{"$error":"#VALUE!"}]
{"$rows_left_out":67}
{"sheet":"Tabellen für Grafik","index":5,"n_rows":5,"n_cols":2,"rows_kept":5,"cut":false,"hidden":true,"merged":[]}
[]
[]
[null,"Strom - Verbrauch"]
[]
[null,"Gesamtergebnis"]

{"sheet":"Stammdaten","index":6,"n_rows":15,"n_cols":3,"rows_kept":15,"cut":false,"hidden":true,"merged":[]}
[]
["Monate"]
[]
[1,"Januar",31]
[2,"Februar",28]
[3,"März",31]
[4,"April",30]
[5,"Mai",31]
[6,"Juni",30]
[7,"Juli",31]
[8,"August",31]
[9,"September",30]
[10,"Oktober",31]
[11,"November",30]
[12,"Dezember",31]